{"text_format":"1","workbook":"xlsx","n_sheets":16,"sheets":["Instructions & Definitions","Assessment Dashboard","Teamwork","5S","Standards","Muda Elimination","TPM","JIT","Employee Involvement","Quality First","Calculation","Observation Summary","Assessment Analysis","QOS - G1","QOS - D1","Scoring Calculation"],"not_rendered":{"charts":22,"images":1,"macros":1,"external_links":2,"defined_names":228,"comments":9,"pivot_tables":0},"unopened":[],"bounds":{"document_bytes":16777216,"sheet_cells":100000,"rows_first":2000,"rows_last":500,"rows_between":2000,"halvings":0,"cell_chars":16384,"cell_head_chars":4096},"cells_cut":0,"cells_raw":0,"read":"whole","date_system":"1900"}

{"sheet":"Instructions & Definitions","index":0,"n_rows":82,"n_cols":9,"rows_kept":82,"cut":false,"hidden":false,"merged":[[55,1,55,2],[55,3,55,15],[47,2,47,15],[48,2,48,15],[49,2,49,15],[24,3,24,15],[25,3,25,15],[31,3,31,15],[44,2,44,15],[46,1,46,15],[34,1,34,3],[35,2,35,15],[39,1,39,15],[40,2,40,15],[41,2,41,15],[42,2,42,15],[43,2,43,15],[1,1,3,15],[10,2,10,15],[11,2,11,15],[14,2,14,15],[15,2,15,15],[13,2,13,15],[12,2,12,15],[16,2,16,15],[17,2,17,15],[19,2,19,15],[20,2,20,15],[21,1,21,3],[22,2,22,15],[18,2,18,15],[54,1,54,2],[54,3,54,15],[28,1,28,3],[32,2,32,15],[52,1,52,2],[52,3,52,15],[53,1,53,2],[53,3,53,15],[26,2,26,15],[29,2,29,15],[38,1,38,15],[51,1,51,15],[30,3,30,15],[23,3,23,15],[56,1,56,2],[56,3,56,15],[57,1,57,2],[57,3,57,15],[58,1,58,2],[58,3,58,15],[59,1,59,2],[59,3,59,15],[60,1,60,2],[60,3,60,15],[61,1,61,2],[61,3,61,15],[62,1,62,2],[62,3,62,15],[63,1,63,2],[63,3,63,15],[64,1,64,2],[64,3,64,15],[65,1,65,2],[65,3,65,15],[66,1,66,2],[66,3,66,15],[67,1,67,2],[67,3,67,15],[68,1,68,2],[68,3,68,15],[69,1,69,2],[69,3,69,15],[70,1,70,2],[70,3,70,15],[71,1,71,2],[71,3,71,15],[72,1,72,2],[72,3,72,15],[73,1,73,2],[73,3,73,15],[74,1,74,2],[74,3,74,15],[75,1,75,2],[75,3,75,15],[76,1,76,2],[76,3,76,15],[80,1,80,2],[80,3,80,15],[81,1,81,2],[81,3,81,15],[77,1,77,2],[77,3,77,15],[78,1,78,2],[78,3,78,15],[79,1,79,2],[79,3,79,15]]}
["VESS 001 Appendix A - VES Assessment"]
[null,"Assessment purpose: To understand the current level of VES application in a site and how the VES level effects the site performance.  To define the gap between where we are today and true north."]
[]
[]
[]
[null,null,null,"Enter the site acronym here →",null,null,null,null,"Enter the date of the assessment →"]
{"$rows_left_out":77}
{"sheet":"Assessment Dashboard","index":1,"n_rows":40,"n_cols":45,"rows_kept":40,"cut":false,"hidden":false,"merged":[[1,0,1,37],[39,36,39,37],[42,36,42,37],[4,9,4,20],[4,29,4,35],[21,4,21,7],[21,20,21,23],[21,11,21,16],[29,12,29,15],[29,17,29,20],[29,22,29,25],[30,7,34,10],[30,12,34,15],[29,2,29,5],[29,7,29,10],[30,2,34,5],[30,17,34,20],[30,22,34,25],[22,4,26,7],[22,12,26,15],[22,20,26,23]]}
["VESS 001 Appendix A - VES Assessment",null,null,null,null,null,null,null,null,null,null,null,null,null,null,null,null,null,null,null,null,null,null,null,null,null,null,null,null,null,null,null,null,null,null,"Site:",{"$f":"IF('Instructions & Definitions'!E6=\"\",\"\",'Instructions & Definitions'!E6)","v":""}]
["VES Assessment Dasboard"]
[]
[]
[null,null,null,null,null,null,null,null,null,"VES House Element Results",null,null,null,null,null,null,null,null,null,null,null,null,null,null,null,null,null,null,null,"Overall Assessment Result"]
[]
{"$rows_left_out":35}
{"sheet":"Teamwork","index":2,"n_rows":27,"n_cols":28,"rows_kept":27,"cut":false,"hidden":false,"merged":[[6,21,6,22],[6,23,6,24],[6,25,6,26],[15,2,25,13],[0,16,0,17],[0,18,0,19],[1,1,3,13],[4,1,4,15],[5,21,5,26],[6,1,7,1],[6,9,6,15],[6,16,6,17],[6,18,6,19],[6,2,6,7]]}
["VESS 001 Appendix A - VES Assessment",null,null,null,null,null,null,null,null,null,null,null,null,null,null,null,"Leadership",null,"Workplace"]
[null,"Team Work",null,null,null,null,null,null,null,null,null,null,null,null,null,null,"Total Achieved",{"$f":"SUM(H9:H26)","v":0},null,{"$f":"SUM(Q9:Q26)","v":0},1,1]
[null,null,null,null,null,null,null,null,null,null,null,null,null,null,null,null,"Total Possible",{"$f":"COUNTA(G9:G26)*5","v":25},null,{"$f":"COUNTA(N9:N26)*5*3","v":75},2,2]
[null,null,null,null,null,null,null,null,null,null,null,null,null,null,null,null,"Percentage",{"$f":"R2/R3","v":0},null,{"$f":"T2/T3","v":0},3,3]
[null,"Mission Statement: Cross functional teams are organized to capture problems early, and then act swiftly to correct.  Regular proactive actions are geared to maintain a stable operation at the Genba*.  Teams seamlessly act horizontally and vertically to implement calculated actions which align with Policy Deployment.",null,null,null,null,null,null,null,null,null,null,null,null,null,null,null,null,null,null,null,4]
[null,null,null,null,null,null,null,null,null,null,null,null,null,null,null,null,null,null,null,null,null,"Changes"]
{"$rows_left_out":22}
{"sheet":"5S","index":3,"n_rows":19,"n_cols":28,"rows_kept":19,"cut":false,"hidden":false,"merged":[[6,21,6,22],[6,23,6,24],[6,25,6,26],[14,2,24,13],[0,16,0,17],[0,18,0,19],[1,1,3,13],[4,1,4,15],[5,21,5,26],[6,1,7,1],[6,9,6,15],[6,16,6,17],[6,18,6,19],[6,2,6,7]]}
["VESS 001 Appendix A - VES Assessment",null,null,null,null,null,null,null,null,null,null,null,null,null,null,null,"Leadership",null,"Workplace"]
[null,"5S",null,null,null,null,null,null,null,null,null,null,null,null,null,null,"Total Achieved",{"$f":"SUM(H9:H21)","v":0},null,{"$f":"SUM(Q9:Q21)","v":0},1]
[null,null,null,null,null,null,null,null,null,null,null,null,null,null,null,null,"Total Possible",{"$f":"COUNTA(G9:G33)*5","v":20},null,{"$f":"COUNTA(N9:N33)*5*3","v":60},2]
[null,null,null,null,null,null,null,null,null,null,null,null,null,null,null,null,"Percentage",{"$f":"R2/R3","v":0},null,{"$f":"T2/T3","v":0},3]
[null,"Mission:  Create a continuously improving environment where everyone can work safely, easily tell normal from abnormal at a glance, and naturally understand the work. All employees understand the connection between 5S and high efficiency.  Create an environment where Customers and Stakeholders* automatically have a positive perception based on the 5S conditions."]
[null,null,null,null,null,null,null,null,null,null,null,null,null,null,null,null,null,null,null,null,null,"Changes"]
{"$rows_left_out":14}
{"sheet":"Standards","index":4,"n_rows":19,"n_cols":28,"rows_kept":19,"cut":false,"hidden":false,"merged":[[6,21,6,22],[6,23,6,24],[6,25,6,26],[14,2,24,13],[0,16,0,17],[0,18,0,19],[1,1,3,13],[4,1,4,15],[5,21,5,26],[6,1,7,1],[6,9,6,15],[6,16,6,17],[6,18,6,19],[6,2,6,7]]}
["VESS 001 Appendix A - VES Assessment",null,null,null,null,null,null,null,null,null,null,null,null,null,null,null,"Leadership",null,"Workplace"]
[null,"Standards",null,null,null,null,null,null,null,null,null,null,null,null,null,null,"Total Achieved",{"$f":"SUM(H9:H26)","v":0},null,{"$f":"SUM(Q9:Q26)","v":0},1]
[null,null,null,null,null,null,null,null,null,null,null,null,null,null,null,null,"Total Possible",{"$f":"COUNTA(G9:G26)*5","v":20},null,{"$f":"COUNTA(N9:N26)*5*3","v":60},2]
[null,null,null,null,null,null,null,null,null,null,null,null,null,null,null,null,"Percentage",{"$f":"R2/R3","v":0},null,{"$f":"T2/T3","v":0},3]
[null,"Mission: Working processes are standardized resulting in work that is performed the exact same way by everyone. The culture demands exactness in following the standards (Work instructions, VS, VESS, MPS, local standards, etc.). The standards are continuously improving and immediately updated."]
[null,null,null,null,null,null,null,null,null,null,null,null,null,null,null,null,null,null,null,null,null,"Changes"]
{"$rows_left_out":14}
{"sheet":"Muda Elimination","index":5,"n_rows":21,"n_cols":28,"rows_kept":21,"cut":false,"hidden":false,"merged":[[6,21,6,22],[6,23,6,24],[6,25,6,26],[16,2,26,13],[0,16,0,17],[0,18,0,19],[1,1,3,13],[4,1,4,15],[5,21,5,26],[6,1,7,1],[6,9,6,15],[6,16,6,17],[6,18,6,19],[6,2,6,7]]}
["VESS 001 Appendix A - VES Assessment",null,null,null,null,null,null,null,null,null,null,null,null,null,null,null,"Leadership",null,"Workplace"]
[null,"Muda Elimination",null,null,null,null,null,null,null,null,null,null,null,null,null,null,"Total Achieved",{"$f":"SUM(H9:H23)","v":0},null,{"$f":"SUM(Q9:Q23)","v":0},1]
[null,null,null,null,null,null,null,null,null,null,null,null,null,null,null,null,"Total Possible",{"$f":"COUNTA(G9:G23)*5","v":30},null,{"$f":"COUNTA(N9:N23)*5*3","v":90},2]
[null,null,null,null,null,null,null,null,null,null,null,null,null,null,null,null,"Percentage",{"$f":"R2/R3","v":0},null,{"$f":"T2/T3","v":0},3]
[null,"Mission: To deeply understand where non-Value Added operations exist, and take strong actions to reduce and eliminate waste throughout the entire value stream.  To have a strong understanding of how Mura* and Muri* contribute to and cause Muda."]
[null,null,null,null,null,null,null,null,null,null,null,null,null,null,null,null,null,null,null,null,null,"Changes"]
{"$rows_left_out":16}
{"sheet":"TPM","index":6,"n_rows":19,"n_cols":28,"rows_kept":19,"cut":false,"hidden":false,"merged":[[6,21,6,22],[6,23,6,24],[6,25,6,26],[14,2,24,13],[0,16,0,17],[0,18,0,19],[1,1,3,13],[4,1,4,15],[5,21,5,26],[6,1,7,1],[6,9,6,15],[6,16,6,17],[6,18,6,19],[6,2,6,7]]}
["VESS 001 Appendix A - VES Assessment",null,null,null,null,null,null,null,null,null,null,null,null,null,null,null,"Leadership",null,"Workplace"]
[null,"TPM",null,null,null,null,null,null,null,null,null,null,null,null,null,null,"Total Achieved",{"$f":"SUM(H9:H26)","v":0},null,{"$f":"SUM(Q9:Q26)","v":0},1]
[null,null,null,null,null,null,null,null,null,null,null,null,null,null,null,null,"Total Possible",{"$f":"COUNTA(G9:G26)*5","v":20},null,{"$f":"COUNTA(N9:N26)*5*3","v":60},2]
[null,null,null,null,null,null,null,null,null,null,null,null,null,null,null,null,"Percentage",{"$f":"R2/R3","v":0},null,{"$f":"T2/T3","v":0},3]
[null,"Mission: Equipment is always kept operational with no breakdowns, faults, or quality issues.  This condition is obtained by developing employee's skills and ability to continuously improved methods, and maintain them with perfect execution."]
[null,null,null,null,null,null,null,null,null,null,null,null,null,null,null,null,null,null,null,null,null,"Changes"]
{"$rows_left_out":14}
{"sheet":"JIT","index":7,"n_rows":27,"n_cols":28,"rows_kept":27,"cut":false,"hidden":false,"merged":[[6,21,6,22],[6,23,6,24],[6,25,6,26],[22,2,32,13],[0,16,0,17],[0,18,0,19],[1,1,3,13],[4,1,4,15],[5,21,5,26],[6,1,7,1],[6,9,6,15],[6,16,6,17],[6,18,6,19],[6,2,6,7]]}
["VESS 001 Appendix A - VES Assessment",null,null,null,null,null,null,null,null,null,null,null,null,null,null,null,"Leadership",null,"Workplace"]
[null,"Just In Time (JIT)",null,null,null,null,null,null,null,null,null,null,null,null,null,null,"Total Achieved",{"$f":"SUM(H9:H25)","v":0},null,{"$f":"SUM(Q9:Q25)","v":0},1]
[null,null,null,null,null,null,null,null,null,null,null,null,null,null,null,null,"Total Possible",{"$f":"COUNTA(G9:G25)*5","v":60},null,{"$f":"COUNTA(N9:N25)*5*3","v":180},2]
[null,null,null,null,null,null,null,null,null,null,null,null,null,null,null,null,"Percentage",{"$f":"R2/R3","v":0},null,{"$f":"T2/T3","v":0},3]
[null,"Mission: Create a continuously improving system which corresponds to customer demand respecting what they want (model & quantity), when they want it (date & time) and where they want it (plant & location), while maintaining minimal inventory (goal is zero inventory).  Required principles, tools, methods and thinking of \"how to harmonize with proper timing\" are well known."]
[null,null,null,null,null,null,null,null,null,null,null,null,null,null,null,null,null,null,null,null,null,"Changes"]
{"$rows_left_out":22}
{"sheet":"Employee Involvement","index":8,"n_rows":22,"n_cols":28,"rows_kept":22,"cut":false,"hidden":false,"merged":[[6,21,6,22],[6,23,6,24],[6,25,6,26],[17,2,27,13],[0,16,0,17],[0,18,0,19],[1,1,3,13],[4,1,4,15],[5,21,5,26],[6,1,7,1],[6,9,6,15],[6,16,6,17],[6,18,6,19],[6,2,6,7]]}
["VESS 001 Appendix A - VES Assessment",null,null,null,null,null,null,null,null,null,null,null,null,null,null,null,"Leadership",null,"Workplace"]
[null,"Employee Involvement",null,null,null,null,null,null,null,null,null,null,null,null,null,null,"Total Achieved",{"$f":"SUM(H9:H26)","v":0},null,{"$f":"SUM(Q9:Q26)","v":0},1]
[null,null,null,null,null,null,null,null,null,null,null,null,null,null,null,null,"Total Possible",{"$f":"COUNTA(G9:G26)*5","v":35},null,{"$f":"COUNTA(N9:N26)*5*3","v":105},2]
[null,null,null,null,null,null,null,null,null,null,null,null,null,null,null,null,"Percentage",{"$f":"R2/R3","v":0},null,{"$f":"T2/T3","v":0},3]
[null,"Mission:  To create a culture where all employees naturally respect standards as a way to ensure safety and continuous improvement.  To increase the number of employees who have a high degree of flexibility and motivation to do the work.  To create the environment where “Ordinary people do extraordinary things everyday”."]
[null,null,null,null,null,null,null,null,null,null,null,null,null,null,null,null,null,null,null,null,null,"Changes"]
{"$rows_left_out":17}
{"sheet":"Quality First","index":9,"n_rows":24,"n_cols":28,"rows_kept":24,"cut":false,"hidden":false,"merged":[[6,21,6,22],[6,23,6,24],[6,25,6,26],[19,2,29,13],[0,16,0,17],[0,18,0,19],[1,1,3,13],[4,1,4,15],[5,21,5,26],[6,1,7,1],[6,9,6,15],[6,16,6,17],[6,18,6,19],[6,2,6,7]]}
["VESS 001 Appendix A - VES Assessment",null,null,null,null,null,null,null,null,null,null,null,null,null,null,null,"Leadership",null,"Workplace"]
[null,"Quality First",null,null,null,null,null,null,null,null,null,null,null,null,null,null,"Total Achieved",{"$f":"SUM(H9:H25)","v":0},null,{"$f":"SUM(Q9:Q25)","v":0},1]
[null,null,null,null,null,null,null,null,null,null,null,null,null,null,null,null,"Total Possible",{"$f":"COUNTA(G9:G25)*5","v":45},null,{"$f":"COUNTA(N9:N25)*5*3","v":135},2]
[null,null,null,null,null,null,null,null,null,null,null,null,null,null,null,null,"Percentage",{"$f":"R2/R3","v":0},null,{"$f":"T2/T3","v":0},3]
[null,"Mission: Create a reliable system where quality is build in at the point of value add in order to achieve zero defects.  To improve this system, the quality tools and methods are understood and used properly.  Prevention activities for new launches are promoted through solid root cause analysis. Continuously moving from reactive to proactive approach."]
[null,null,null,null,null,null,null,null,null,null,null,null,null,null,null,null,null,null,null,null,null,"Changes"]
{"$rows_left_out":19}
{"sheet":"Calculation","index":10,"n_rows":113,"n_cols":48,"rows_kept":113,"cut":false,"hidden":false,"merged":[[1,1,1,52],[3,2,3,51],[4,2,4,5],[4,7,4,10],[4,12,4,30],[4,32,4,51],[9,2,10,5],[9,7,10,10],[9,12,10,30],[9,47,9,51],[10,32,10,35],[10,37,10,40],[10,42,10,45],[10,47,10,51],[6,2,7,5],[6,7,7,10],[6,12,7,30],[6,32,6,35],[6,42,6,45],[6,47,6,51],[7,32,7,35],[7,37,7,40],[7,42,7,45],[7,47,7,51],[12,2,13,5],[12,7,13,10],[12,12,13,30],[12,47,12,51],[13,47,13,51],[15,2,16,5],[15,7,16,10],[15,12,16,30],[15,33,15,38],[15,41,15,45],[15,47,15,51],[16,33,16,38],[16,41,16,45],[16,47,16,51],[18,2,19,5],[18,7,19,10],[18,12,19,30],[18,32,18,35],[18,37,18,40],[18,42,18,45],[18,47,18,51],[19,32,19,35],[19,37,19,40],[19,42,19,45],[19,47,19,51],[23,42,23,43],[23,44,23,45],[21,42,21,45],[22,32,22,33],[22,34,22,35],[22,37,22,38],[22,39,22,40],[22,42,22,43],[22,44,22,45],[21,32,21,35],[21,37,21,40],[23,32,23,33],[23,34,23,35],[23,37,23,38],[23,39,23,40],[25,42,25,43],[25,44,25,45],[24,32,24,33],[24,34,24,35],[24,37,24,38],[24,39,24,40],[24,42,24,43],[24,44,24,45],[27,32,27,33],[27,34,27,35],[27,37,27,38],[27,39,27,40],[27,42,27,43],[27,44,27,45],[26,32,26,33],[26,34,26,35],[26,37,26,38],[26,39,26,40],[26,42,26,43],[26,44,26,45],[25,32,25,33],[25,34,25,35],[25,37,25,38],[25,39,25,40],[28,32,28,33],[28,34,28,35],[28,37,28,38],[28,39,28,40],[28,42,28,43],[28,44,28,45],[30,39,30,40],[30,42,30,43],[30,44,30,45],[29,32,29,33],[29,34,29,35],[29,37,29,38],[29,39,29,40],[29,42,29,43],[29,44,29,45],[30,32,30,33],[30,34,30,35],[30,37,30,38],[31,42,31,43],[31,44,31,45],[31,47,32,51],[32,32,32,33],[32,34,32,35],[34,2,35,5],[34,7,35,10],[34,12,35,30],[34,32,34,35],[34,37,34,40],[34,42,34,45],[34,47,34,51],[35,32,35,35],[35,37,35,40],[35,42,35,45],[35,47,35,51],[21,2,32,5],[21,7,32,10],[21,12,32,30],[31,32,31,33],[31,34,31,35],[31,37,31,38],[31,39,31,40],[28,47,30,51],[37,2,42,5],[37,7,42,10],[37,12,42,30],[37,32,37,35],[37,37,37,40],[37,42,37,45],[40,32,40,35],[40,37,40,40],[40,42,40,45],[41,32,41,35],[41,37,41,40],[41,42,41,45],[38,32,38,35],[38,37,38,40],[38,42,38,45],[39,32,39,35],[39,37,39,40],[39,42,39,45],[41,47,41,51],[42,32,42,35],[42,37,42,40],[42,42,42,45],[42,47,42,51],[44,2,56,5],[44,7,56,10],[44,12,56,30],[44,32,44,37],[44,39,44,44],[47,32,47,34],[47,35,47,37],[47,39,47,41],[47,42,47,44],[48,32,48,34],[48,35,48,37],[48,39,48,41],[48,42,48,44],[45,32,45,34],[45,35,45,37],[45,39,45,41],[45,42,45,44],[46,32,46,34],[46,35,46,37],[46,39,46,41],[46,42,46,44],[51,32,51,34],[51,35,51,37],[51,39,51,41],[51,42,51,44],[52,32,52,34],[52,35,52,37],[52,39,52,41],[52,42,52,44],[49,32,49,34],[49,35,49,37],[49,39,49,41],[49,42,49,44],[50,32,50,34],[50,35,50,37],[50,39,50,41],[50,42,50,44],[66,47,66,51],[58,2,59,5],[58,7,59,10],[58,12,59,30],[58,32,58,35],[58,37,58,40],[52,47,54,51],[53,32,53,34],[53,35,53,37],[53,39,53,41],[53,42,53,44],[54,32,54,34],[54,35,54,37],[54,39,54,41],[54,42,54,44],[58,42,58,45],[58,47,58,51],[59,32,59,35],[59,37,59,40],[59,42,59,45],[59,47,59,51],[55,32,55,34],[55,35,55,37],[55,39,55,41],[55,47,56,51],[63,37,63,40],[63,42,63,45],[64,32,64,35],[64,37,64,40],[64,42,64,45],[65,32,65,35],[65,37,65,40],[65,42,65,45],[65,47,65,51],[55,42,55,44],[70,32,70,35],[70,37,70,40],[70,42,70,45],[61,42,61,45],[62,32,62,35],[62,37,62,40],[62,42,62,45],[63,32,63,35],[66,32,66,35],[66,37,66,40],[66,42,66,45],[61,2,66,5],[61,7,66,10],[61,12,66,30],[61,32,61,35],[61,37,61,40],[75,42,75,45],[76,32,76,35],[76,37,76,40],[76,42,76,45],[68,2,73,5],[68,7,73,10],[68,12,73,30],[68,32,68,35],[68,37,68,40],[71,32,71,35],[71,37,71,40],[71,42,71,45],[72,32,72,35],[72,37,72,40],[72,42,72,45],[68,42,68,45],[69,32,69,35],[69,37,69,40],[69,42,69,45],[77,32,77,35],[77,37,77,40],[77,42,77,45],[72,47,72,51],[73,32,73,35],[73,37,73,40],[73,42,73,45],[73,47,73,51],[75,32,75,35],[75,37,75,40],[80,47,80,51],[82,2,87,5],[82,7,87,10],[82,12,87,30],[82,32,82,35],[82,37,82,40],[82,42,82,45],[78,32,78,35],[78,37,78,40],[78,42,78,45],[78,47,79,51],[79,32,79,35],[79,37,79,40],[79,42,79,45],[75,2,80,5],[75,7,80,10],[75,12,80,30],[83,32,83,35],[83,37,83,40],[83,42,83,45],[84,32,84,35],[84,37,84,40],[84,42,84,45],[80,32,80,35],[80,37,80,40],[80,42,80,45],[89,2,90,5],[89,7,90,10],[89,12,90,30],[89,32,89,35],[89,37,89,40],[85,32,85,35],[85,37,85,40],[85,42,85,45],[86,32,86,35],[86,37,86,40],[86,42,86,45],[89,42,89,45],[89,47,89,51],[90,32,90,35],[90,37,90,40],[90,42,90,45],[90,47,90,51],[86,47,86,51],[87,32,87,35],[87,37,87,40],[87,42,87,45],[87,47,87,51],[92,47,92,51],[93,32,93,35],[93,37,93,40],[93,42,93,45],[93,47,93,51],[95,2,100,5],[95,7,100,10],[95,12,100,30],[95,32,95,35],[95,37,95,40],[92,2,93,5],[92,7,93,10],[92,12,93,30],[92,32,92,35],[92,37,92,40],[92,42,92,45],[98,32,98,35],[98,37,98,40],[98,42,98,45],[98,47,99,51],[99,32,99,35],[99,37,99,40],[99,42,99,45],[95,42,95,45],[96,32,96,35],[96,37,96,40],[96,42,96,45],[97,32,97,35],[97,37,97,40],[97,42,97,45],[105,2,106,5],[105,7,106,10],[105,12,106,30],[105,32,105,35],[105,37,105,40],[100,32,100,35],[100,37,100,40],[100,42,100,45],[106,32,106,35],[106,37,106,40],[106,42,106,45],[100,47,100,51],[102,2,103,5],[102,7,103,10],[102,12,103,30],[102,32,102,35],[102,37,102,40],[102,42,102,45],[105,42,105,45],[105,47,105,51],[106,47,106,51],[102,47,102,51],[103,32,103,35],[103,37,103,40],[103,42,103,45],[103,47,103,51],[108,47,108,51],[109,32,109,35],[109,37,109,40],[109,42,109,45],[109,47,109,51],[108,42,108,45],[111,2,112,5],[111,7,112,10],[111,12,112,30],[111,32,111,35],[111,37,111,40],[108,2,109,5],[108,7,109,10],[108,12,109,30],[108,32,108,35],[108,37,108,40],[116,35,116,38],[116,40,116,43],[116,45,116,49],[118,46,118,49],[111,42,111,45],[111,47,111,51],[112,32,112,35],[112,37,112,40],[112,42,112,45],[112,47,112,51]]}
["VESS 001 Appendix A - VES Assessment"]
[null,"VES Assessment Standard Calculations"]
[]
[null,null,"Note: If the  data does not exist for a specific element and/or component then the Lead Calibrator has the final say on how to quantify the level. "]
[null,null,"Element",null,null,null,null,"Component",null,null,null,null,"Instructions",null,null,null,null,null,null,null,null,null,null,null,null,null,null,null,null,null,null,null,"Standard Calculation"]
[]
{"$rows_left_out":108}
{"sheet":"Observation Summary","index":11,"n_rows":12,"n_cols":3,"rows_kept":12,"cut":false,"hidden":false,"merged":[[1,1,1,2]]}
["VESS 001 Appendix A - VES Assessment"]
[null,"Main Take Away Summary"]
[]
[null,"Element","Main take away from each element tab"]
[null,"Team Work",{"$f":"Teamwork!C16","v":0}]
[null,"5S",{"$f":"'5S'!C15","v":0}]
{"$rows_left_out":7}
{"sheet":"Assessment Analysis","index":12,"n_rows":1,"n_cols":1,"rows_kept":1,"cut":false,"hidden":false,"merged":[]}
["VESS 001 Appendix A - VES Assessment"]

{"sheet":"QOS - G1","index":13,"n_rows":17,"n_cols":19,"rows_kept":17,"cut":false,"hidden":false,"merged":[[13,5,13,11],[13,17,13,18],[1,0,1,18],[2,1,2,5],[2,7,2,18],[3,1,4,1],[3,2,4,2],[3,3,4,3],[3,4,4,4],[3,5,4,5],[3,7,3,18]]}
["VESS 001 Appendix A - VES Assessment"]
[{"$f":"'QOS - D1'!B1","v":"VES Assessment Score \"Plant name\""}]
[1,null,null,null,null,null,2]
[3,"Problem Description","Corrective Action","Target Date / Responsible","Implemen-tation Status","Final Completion",4,"Achieved Results"]
["No.",null,null,null,null,null,"No.","2018-01-01","2018-02-01","2018-03-01","2018-04-01","2018-05-01","2018-06-01","2018-07-01","2018-08-01","2018-09-01","2018-10-01","2018-11-01","2018-12-01"]
[1,"TW",null,null,null,null,1]
{"$rows_left_out":12}
{"sheet":"QOS - D1","index":14,"n_rows":22,"n_cols":13,"rows_kept":22,"cut":false,"hidden":false,"merged":[[35,19,35,21],[0,1,0,4],[4,1,4,4],[5,1,5,4],[6,1,6,4],[18,1,18,4],[19,1,19,4]]}
["Sheet title","VES Assessment Score \"Plant name\""]
[]
["1.)   TREND GRAPH"]
[]
["Graph title","VES Assessment Score"]
["Y-axis title","Score"]
{"$rows_left_out":17}
{"sheet":"Scoring Calculation","index":15,"n_rows":21,"n_cols":18,"rows_kept":21,"cut":false,"hidden":false,"merged":[[15,2,15,3],[15,5,15,6],[1,2,1,15],[2,2,2,4],[2,5,2,7],[2,13,2,14],[2,15,3,15]]}
[]
[null,"Application","Elements of the VES House"]
[null,"Level","Leadership",null,null,"Workplace",null,null,null,null,null,null,null,"Total",null,"%"]
[null,"Key Element","Achieved","Possible","%","Achieved","Possible","%",null,null,null,null,null,"Achieved","Possible"]
[null,"Teamwork",{"$f":"Teamwork!R2","v":0},{"$f":"Teamwork!R3","v":25},{"$f":"C5/D5","v":0},{"$f":"Teamwork!T2","v":0},{"$f":"Teamwork!T3","v":75},{"$f":"F5/G5","v":0},null,null,null,null,null,{"$f":"C5+F5","v":0},100,{"$f":"N5/O5","v":0},{"$f":"P5","v":0},{"$f":"Q5*100","v":0}]
[null,"5S",{"$f":"'5S'!R2","v":0},{"$f":"'5S'!R3","v":20},{"$f":"C6/D6","v":0},{"$f":"'5S'!T2","v":0},{"$f":"'5S'!T3","v":60},{"$f":"F6/G6","v":0},null,null,null,null,null,0,80,{"$f":"N6/O6","v":0},{"$f":"P6","v":0},{"$f":"Q6*100","v":0}]
{"$rows_left_out":15}