{"text_format":"1","workbook":"xlsx","n_sheets":4,"sheets":["Coversheet","Questionnaire","Actions","Information"],"not_rendered":{"charts":0,"images":1,"macros":0,"external_links":0,"defined_names":7,"comments":1,"pivot_tables":0},"unopened":[],"bounds":{"document_bytes":16777216,"sheet_cells":100000,"rows_first":2000,"rows_last":500,"rows_between":2000,"halvings":0,"cell_chars":16384,"cell_head_chars":4096},"cells_cut":0,"cells_raw":0,"read":"whole","date_system":"1900"}

{"sheet":"Coversheet","index":0,"n_rows":59,"n_cols":22,"rows_kept":59,"cut":false,"hidden":false,"merged":[[35,7,35,10],[3,0,3,1],[13,14,13,15],[11,2,11,15],[29,6,31,10],[29,11,31,15],[29,2,31,5],[0,13,0,15],[1,13,1,15],[5,2,5,15],[9,2,9,15],[34,7,34,10],[26,11,28,15],[7,2,7,15],[26,2,28,5],[26,6,28,10],[13,10,13,13],[15,2,15,15],[13,2,13,8],[22,8,22,14],[3,11,3,14],[52,1,53,1],[52,2,54,15],[45,6,45,8],[46,1,46,2],[0,0,1,10],[0,11,0,12],[1,11,1,12],[34,11,34,15],[38,14,38,15],[39,1,40,1],[39,2,41,15],[34,1,34,3],[35,0,35,2],[36,0,36,2],[37,0,37,2],[38,0,38,2]]}
["Production Trial Run Checklist",null,null,null,null,null,null,null,null,null,null,"SQP number: ",null,"xxxxxx"]
[null,null,null,null,null,null,null,null,null,null,null,"Audit  Date:"]
[]
["Supplier name:",null,null,null,null,null,null,null,null,null,null,"Supplier Code:"]
[]
[null,"Prod. Site:"]
[]
[null,"Address:"]
[]
[null,"Process(es):"]
[]
[null,"Products:"]
[]
[null," Part name:",null,null,null,null,null,null,null,null,"Part number / index:"]
[]
[null,"Veoneer program: "]
[]
[null,"Type of Production Trial"]
[null,null," "]
[null,null,"First Production Trial Run"]
[null,null,"PPAP Production Trial Run"]
[null,null,"Run @ Rate"]
[null,null,"Others*"]
[null,null," ",null,null,null,null,null,"* (Explain)"]
[]
[]
[null,"Participants "]
[null,"Supplier"]
[]
[null,"Participants"]
{"$rows_left_out":30}
{"sheet":"Questionnaire","index":1,"n_rows":43,"n_cols":13,"rows_kept":43,"cut":false,"hidden":false,"merged":[[0,0,2,4],[42,7,42,9],[0,7,0,10],[1,7,1,10],[2,7,2,10]]}
["Production Trial Run Checklist - Questionnaire"]
[null,null,null,null,null,null,null,"Audit  Date:",null,null,null,{"$f":"Coversheet!N2","v":0}]
[null,null,null,null,null,null,null,"Supplier:",null,null,null,{"$f":"Coversheet!C4","v":0}]
[]
["Dev. No.",null,"Quest. No.",null,"Item","Audited",null,"Evaluation",null,null,null,"Findings/Remarks"]
[null,"A",null,null,"MANUFACTURING PROCESS ","yes","no","Ma","Mi","Ip","C","Mandatory for Ma,Mi & IP"]
[{"$f":"IF(AND(F7=\"X\",K7=\"\"),(MAX(A6:A$6)+1),\"\")","v":1},"A1",1,null,"Is the product manufactured under serial conditions e.g. production site, production tooling, gauges, process materials, operators, environment and process settings?","x",null,"x",null,null,null,null,{"$f":"IF(SUM(ISBLANK(H7)*1)<1,\"MA\",IF(SUM(ISBLANK(I7)*1)<1,\"MI\",IF(SUM(ISBLANK(J7)*1)<1,\"IP\",\"C\")))","v":"MA"}]
[{"$f":"IF(AND(F8=\"X\",K8=\"\"),(MAX(A$6:A7)+1),\"\")","v":2},"A2",2,null,"Is the actual process flow in line with the process flow diagram, as documented in the PPAP?  (check Aligment of process steps and material flow with the flow diagram)","x",null,null,"x",null,null,null,{"$f":"IF(SUM(ISBLANK(H8)*1)<1,\"MA\",IF(SUM(ISBLANK(I8)*1)<1,\"MI\",IF(SUM(ISBLANK(J8)*1)<1,\"IP\",\"C\")))","v":"MI"}]
[{"$f":"IF(AND(F9=\"X\",K9=\"\"),(MAX(A$6:A8)+1),\"\")","v":3},"A3",3,null,"Are approved operator instructions/visual controls available for each work station?","x",null,null,"x",null,null,null,"MI"]
[{"$f":"IF(AND(F10=\"X\",K10=\"\"),(MAX(A$6:A9)+1),\"\")","v":4},"A4",4,null,"Is all in-process documentation, such as process control charts, in place at the time of the Run @ Rate? Is the documentation used to drive a defined reaction plan and corrective action process?","x",null,null,null,"x",null,null,"IP"]
[{"$f":"IF(AND(F11=\"X\",K11=\"\"),(MAX(A$6:A10)+1),\"\")","v":5},"A5",5,null,"Are production boundary samples available at the required work stations, if applicable? Are the boundary samples approved by Veoneer & latest version confirmed against the drawing?","x",null,null,null,"x",null,null,"IP"]
[{"$f":"IF(AND(F12=\"X\",K12=\"\"),(MAX(A$6:A11)+1),\"\")","v":""},"A6",6,null,"Are maintenance plans in place? Are repair and maintenance parts available? Is there a planned downtime for preventive maintenance?","x",null,null,null,null,"x",null,"C"]
[{"$f":"IF(AND(F13=\"X\",K13=\"\"),(MAX(A$6:A12)+1),\"\")","v":""},"A7",7,null,"Are all the production start-up and change-over procedures in place and are they verified for effectiveness?","x",null,null,null,null,"x",null,"C"]
[{"$f":"IF(AND(F14=\"X\",K14=\"\"),(MAX(A$6:A13)+1),\"\")","v":""},"A8",8,null,"Have all the personnel involved in manufacturing of the product (operators, maintenance, testing, etc.) been adequately trained (refer to the training plan defined in S-APQP)?",null,null,null,null,null,null,null,"C"]
[{"$f":"IF(AND(F15=\"X\",K15=\"\"),(MAX(A$6:A14)+1),\"\")","v":""},"A9",9,null,"Is the PFMEA Go&See done and all findings closed? (VS104)",null,null,null,null,null,null,null,"C"]
[{"$f":"IF(AND(F16=\"X\",K16=\"\"),(MAX(A$7:A14)+1),\"\")","v":""},"B",null,null,"PRODUCTION READINESS",null,null,null,null,null,null,null,"C"]
[{"$f":"IF(AND(F17=\"X\",K17=\"\"),(MAX(A$6:A16)+1),\"\")","v":""},"B1","1",null,"Are all gauges approved by MSA?",null,null,null,null,null,null,null,"C"]
[{"$f":"IF(AND(F18=\"X\",K18=\"\"),(MAX(A$6:A17)+1),\"\")","v":""},"B2","2",null,"Are all in-process gauges, automatic 100% test devices validated, approved and in place?",null,null,null,null,null,null,null,"C"]
[{"$f":"IF(AND(F19=\"X\",K19=\"\"),(MAX(A$6:A18)+1),\"\")","v":""},"B3","3",null,"Does the process control plan match the actual process and PFMEA? Are SPC charts implemented according to the control plan? Are they set up with Control Limits? ",null,null,null,null,null,null,null,"C"]
[{"$f":"IF(AND(F20=\"X\",K20=\"\"),(MAX(A$6:A19)+1),\"\")","v":""},"B4","4",null,"Are all actions from the PFMEA closed?",null,null,null,null,null,null,null,"C"]
[{"$f":"IF(AND(F21=\"X\",K21=\"\"),(MAX(A$6:A20)+1),\"\")","v":""},"B5",5,null,"Does the first/PPAP production trial run meet Veoneer’s capacity requirements? \n",null,null,null,null,null,null,null,"C"]
[{"$f":"IF(AND(F22=\"X\",K22=\"\"),(MAX(A$6:A21)+1),\"\")","v":""},"B6","6",null,"Is an interim inspection plan in place & does it fullfill the VS412 requirement?",null,null,null,null,null,null,null,"C"]
[{"$f":"IF(AND(F23=\"X\",K23=\"\"),(MAX(A$6:A22)+1),\"\")","v":""},"B7","7",null,"Are the CC/SC requirements according VS052 fulfilled? If not, action plan from supplier to fulfill VS052 requirements is mandatory. If non conforming parts are found in the 100% inspection/poka-yoke function, corrective action plan is mandatory",null,null,null,null,null,null,null,"C"]
[{"$f":"IF(AND(F24=\"X\",K24=\"\"),(MAX(A$6:A23)+1),\"\")","v":""},"B8","8",null,"Is the Dock Audit Report for the product established and agreed with Veoneer? (VS041)",null,null,null,null,null,null,null,"C"]
[{"$f":"IF(AND(F25=\"X\",K25=\"\"),(MAX(A$6:A24)+1),\"\")","v":""},"B9","9",null,"Is the process control plan sufficient to effectively meet the design record requirements,  e.g., control points, frequency of checks, etc.?",null,null,null,null,null,null,null,"C"]
[{"$f":"IF(AND(F26=\"X\",K26=\"\"),(MAX(A$6:A25)+1),\"\")","v":""},"B10","10",null,"Does the Serial Control Plan consider annual Layout inspection as required in VSM?",null,null,null,null,null,null,null,"C"]
[{"$f":"IF(AND(F27=\"X\",K27=\"\"),(MAX(A$7:A25)+1),\"\")","v":""},"B11","11",null,"Nonconformance",null,null,null,null,null,null,null,"C"]
[{"$f":"IF(AND(F28=\"X\",K28=\"\"),(MAX(A$6:A27)+1),\"\")","v":""},"B11a"," ","a"," Are reaction plan available in control plan for nonconformances?",null,null,null,null,null,null,null,"C"]
[{"$f":"IF(AND(F29=\"X\",K29=\"\"),(MAX(A$6:A28)+1),\"\")","v":""},"B11b",null,"b","Are all findings from previous Trial Runs closed?",null,null,null,null,null,null,null,"C"]
[{"$f":"IF(AND(F30=\"X\",K30=\"\"),(MAX(A$6:A29)+1),\"\")","v":""},"B11c",null,"c","Does the PFMEA consider previous failures from external and internal customers on current and similar products / processes? ",null,null,null,null,null,null,null,"C"]
{"$rows_left_out":14}
{"sheet":"Actions","index":2,"n_rows":43,"n_cols":9,"rows_kept":43,"cut":false,"hidden":false,"merged":[[0,0,2,6]]}
["Production Trial Run Checklist - Findings",null,null,null,null,null,null,"Company/Audit No./Year"]
[null,null,null,null,null,null,null,"Audit  Date:",{"$f":"Coversheet!N2","v":0}]
[null,null,null,null,null,null,null,"Supplier:",{"$f":"Coversheet!C4","v":0}]
[]
["Dev.   No.","Systematic","Process Specific","Audit Question No.","Finding/Improvement Potential","Rating","Corrective Action","Responsible","Correction\nDate\n(YYYY-MM-DD)"]
[1,null,null,{"$f":"IF(COUNT(Questionnaire!$A$7:$A$40)<$A6,\" \",VLOOKUP($A6,Questionnaire!$A$7:$J$41,2,FALSE))","v":"A1"},{"$f":"IF(COUNT(Questionnaire!$A$7:$A$40)<$A6,\" \",IF(ISNA(VLOOKUP($A6,Questionnaire!$A$7:$O$41,12,FALSE)),\"\",VLOOKUP($A6,Questionnaire!$A$7:$O$41,12,FALSE)))","v":0},{"$f":"IF(COUNT(Questionnaire!$A$7:$A$40)<$A6,\" \",IF(ISNA(VLOOKUP($A6, Questionnaire!$A$7:$M$41,13,FALSE)),\"\",VLOOKUP($A6, Questionnaire!$A$7:$M$41,13,FALSE)))","v":"MA"}]
[2,null,null,{"$f":"IF(COUNT(Questionnaire!$A$7:$A$40)<$A7,\" \",VLOOKUP($A7,Questionnaire!$A$7:$J$41,2,FALSE))","v":"A2"},{"$f":"IF(COUNT(Questionnaire!$A$7:$A$40)<$A7,\" \",IF(ISNA(VLOOKUP($A7,Questionnaire!$A$7:$O$41,12,FALSE)),\"\",VLOOKUP($A7,Questionnaire!$A$7:$O$41,12,FALSE)))","v":0},{"$f":"IF(COUNT(Questionnaire!$A$7:$A$40)<$A7,\" \",IF(ISNA(VLOOKUP($A7, Questionnaire!$A$7:$M$41,13,FALSE)),\"\",VLOOKUP($A7, Questionnaire!$A$7:$M$41,13,FALSE)))","v":"MI"}]
[3,null,null,{"$f":"IF(COUNT(Questionnaire!$A$7:$A$40)<$A8,\" \",VLOOKUP($A8,Questionnaire!$A$7:$J$41,2,FALSE))","v":"A3"},{"$f":"IF(COUNT(Questionnaire!$A$7:$A$40)<$A8,\" \",IF(ISNA(VLOOKUP($A8,Questionnaire!$A$7:$O$41,12,FALSE)),\"\",VLOOKUP($A8,Questionnaire!$A$7:$O$41,12,FALSE)))","v":0},{"$f":"IF(COUNT(Questionnaire!$A$7:$A$40)<$A8,\" \",IF(ISNA(VLOOKUP($A8, Questionnaire!$A$7:$M$41,13,FALSE)),\"\",VLOOKUP($A8, Questionnaire!$A$7:$M$41,13,FALSE)))","v":"MI"}]
[4,null,null,{"$f":"IF(COUNT(Questionnaire!$A$7:$A$40)<$A9,\" \",VLOOKUP($A9,Questionnaire!$A$7:$J$41,2,FALSE))","v":"A4"},{"$f":"IF(COUNT(Questionnaire!$A$7:$A$40)<$A9,\" \",IF(ISNA(VLOOKUP($A9,Questionnaire!$A$7:$O$41,12,FALSE)),\"\",VLOOKUP($A9,Questionnaire!$A$7:$O$41,12,FALSE)))","v":0},{"$f":"IF(COUNT(Questionnaire!$A$7:$A$40)<$A9,\" \",IF(ISNA(VLOOKUP($A9, Questionnaire!$A$7:$M$41,13,FALSE)),\"\",VLOOKUP($A9, Questionnaire!$A$7:$M$41,13,FALSE)))","v":"IP"}]
[5,null,null,{"$f":"IF(COUNT(Questionnaire!$A$7:$A$40)<$A10,\" \",VLOOKUP($A10,Questionnaire!$A$7:$J$41,2,FALSE))","v":"A5"},{"$f":"IF(COUNT(Questionnaire!$A$7:$A$40)<$A10,\" \",IF(ISNA(VLOOKUP($A10,Questionnaire!$A$7:$O$41,12,FALSE)),\"\",VLOOKUP($A10,Questionnaire!$A$7:$O$41,12,FALSE)))","v":0},{"$f":"IF(COUNT(Questionnaire!$A$7:$A$40)<$A10,\" \",IF(ISNA(VLOOKUP($A10, Questionnaire!$A$7:$M$41,13,FALSE)),\"\",VLOOKUP($A10, Questionnaire!$A$7:$M$41,13,FALSE)))","v":"IP"}]
[6,null,null,{"$f":"IF(COUNT(Questionnaire!$A$7:$A$40)<$A11,\" \",VLOOKUP($A11,Questionnaire!$A$7:$J$41,2,FALSE))","v":" "},{"$f":"IF(COUNT(Questionnaire!$A$7:$A$40)<$A11,\" \",IF(ISNA(VLOOKUP($A11,Questionnaire!$A$7:$O$41,12,FALSE)),\"\",VLOOKUP($A11,Questionnaire!$A$7:$O$41,12,FALSE)))","v":" "},{"$f":"IF(COUNT(Questionnaire!$A$7:$A$40)<$A11,\" \",IF(ISNA(VLOOKUP($A11, Questionnaire!$A$7:$M$41,13,FALSE)),\"\",VLOOKUP($A11, Questionnaire!$A$7:$M$41,13,FALSE)))","v":" "}]
[7,null,null,{"$f":"IF(COUNT(Questionnaire!$A$7:$A$40)<$A12,\" \",VLOOKUP($A12,Questionnaire!$A$7:$J$41,2,FALSE))","v":" "},{"$f":"IF(COUNT(Questionnaire!$A$7:$A$40)<$A12,\" \",IF(ISNA(VLOOKUP($A12,Questionnaire!$A$7:$O$41,12,FALSE)),\"\",VLOOKUP($A12,Questionnaire!$A$7:$O$41,12,FALSE)))","v":" "},{"$f":"IF(COUNT(Questionnaire!$A$7:$A$40)<$A12,\" \",IF(ISNA(VLOOKUP($A12, Questionnaire!$A$7:$M$41,13,FALSE)),\"\",VLOOKUP($A12, Questionnaire!$A$7:$M$41,13,FALSE)))","v":" "}]
[8,null,null,{"$f":"IF(COUNT(Questionnaire!$A$7:$A$40)<$A13,\" \",VLOOKUP($A13,Questionnaire!$A$7:$J$41,2,FALSE))","v":" "},{"$f":"IF(COUNT(Questionnaire!$A$7:$A$40)<$A13,\" \",IF(ISNA(VLOOKUP($A13,Questionnaire!$A$7:$O$41,12,FALSE)),\"\",VLOOKUP($A13,Questionnaire!$A$7:$O$41,12,FALSE)))","v":" "},{"$f":"IF(COUNT(Questionnaire!$A$7:$A$40)<$A13,\" \",IF(ISNA(VLOOKUP($A13, Questionnaire!$A$7:$M$41,13,FALSE)),\"\",VLOOKUP($A13, Questionnaire!$A$7:$M$41,13,FALSE)))","v":" "}]
[9,null,null,{"$f":"IF(COUNT(Questionnaire!$A$7:$A$40)<$A14,\" \",VLOOKUP($A14,Questionnaire!$A$7:$J$41,2,FALSE))","v":" "},{"$f":"IF(COUNT(Questionnaire!$A$7:$A$40)<$A14,\" \",IF(ISNA(VLOOKUP($A14,Questionnaire!$A$7:$O$41,12,FALSE)),\"\",VLOOKUP($A14,Questionnaire!$A$7:$O$41,12,FALSE)))","v":" "},{"$f":"IF(COUNT(Questionnaire!$A$7:$A$40)<$A14,\" \",IF(ISNA(VLOOKUP($A14, Questionnaire!$A$7:$M$41,13,FALSE)),\"\",VLOOKUP($A14, Questionnaire!$A$7:$M$41,13,FALSE)))","v":" "}]
[10,null,null,{"$f":"IF(COUNT(Questionnaire!$A$7:$A$40)<$A15,\" \",VLOOKUP($A15,Questionnaire!$A$7:$J$41,2,FALSE))","v":" "},{"$f":"IF(COUNT(Questionnaire!$A$7:$A$40)<$A15,\" \",IF(ISNA(VLOOKUP($A15,Questionnaire!$A$7:$O$41,12,FALSE)),\"\",VLOOKUP($A15,Questionnaire!$A$7:$O$41,12,FALSE)))","v":" "},{"$f":"IF(COUNT(Questionnaire!$A$7:$A$40)<$A15,\" \",IF(ISNA(VLOOKUP($A15, Questionnaire!$A$7:$M$41,13,FALSE)),\"\",VLOOKUP($A15, Questionnaire!$A$7:$M$41,13,FALSE)))","v":" "}]
[11,null,null,{"$f":"IF(COUNT(Questionnaire!$A$7:$A$40)<$A16,\" \",VLOOKUP($A16,Questionnaire!$A$7:$J$41,2,FALSE))","v":" "},{"$f":"IF(COUNT(Questionnaire!$A$7:$A$40)<$A16,\" \",IF(ISNA(VLOOKUP($A16,Questionnaire!$A$7:$O$41,12,FALSE)),\"\",VLOOKUP($A16,Questionnaire!$A$7:$O$41,12,FALSE)))","v":" "},{"$f":"IF(COUNT(Questionnaire!$A$7:$A$40)<$A16,\" \",IF(ISNA(VLOOKUP($A16, Questionnaire!$A$7:$M$41,13,FALSE)),\"\",VLOOKUP($A16, Questionnaire!$A$7:$M$41,13,FALSE)))","v":" "}]
[12,null,null,{"$f":"IF(COUNT(Questionnaire!$A$7:$A$40)<$A17,\" \",VLOOKUP($A17,Questionnaire!$A$7:$J$41,2,FALSE))","v":" "},{"$f":"IF(COUNT(Questionnaire!$A$7:$A$40)<$A17,\" \",IF(ISNA(VLOOKUP($A17,Questionnaire!$A$7:$O$41,12,FALSE)),\"\",VLOOKUP($A17,Questionnaire!$A$7:$O$41,12,FALSE)))","v":" "},{"$f":"IF(COUNT(Questionnaire!$A$7:$A$40)<$A17,\" \",IF(ISNA(VLOOKUP($A17, Questionnaire!$A$7:$M$41,13,FALSE)),\"\",VLOOKUP($A17, Questionnaire!$A$7:$M$41,13,FALSE)))","v":" "}]
[13,null,null,{"$f":"IF(COUNT(Questionnaire!$A$7:$A$40)<$A18,\" \",VLOOKUP($A18,Questionnaire!$A$7:$J$41,2,FALSE))","v":" "},{"$f":"IF(COUNT(Questionnaire!$A$7:$A$40)<$A18,\" \",IF(ISNA(VLOOKUP($A18,Questionnaire!$A$7:$O$41,12,FALSE)),\"\",VLOOKUP($A18,Questionnaire!$A$7:$O$41,12,FALSE)))","v":" "},{"$f":"IF(COUNT(Questionnaire!$A$7:$A$40)<$A18,\" \",IF(ISNA(VLOOKUP($A18, Questionnaire!$A$7:$M$41,13,FALSE)),\"\",VLOOKUP($A18, Questionnaire!$A$7:$M$41,13,FALSE)))","v":" "}]
[14,null,null,{"$f":"IF(COUNT(Questionnaire!$A$7:$A$40)<$A19,\" \",VLOOKUP($A19,Questionnaire!$A$7:$J$41,2,FALSE))","v":" "},{"$f":"IF(COUNT(Questionnaire!$A$7:$A$40)<$A19,\" \",IF(ISNA(VLOOKUP($A19,Questionnaire!$A$7:$O$41,12,FALSE)),\"\",VLOOKUP($A19,Questionnaire!$A$7:$O$41,12,FALSE)))","v":" "},{"$f":"IF(COUNT(Questionnaire!$A$7:$A$40)<$A19,\" \",IF(ISNA(VLOOKUP($A19, Questionnaire!$A$7:$M$41,13,FALSE)),\"\",VLOOKUP($A19, Questionnaire!$A$7:$M$41,13,FALSE)))","v":" "}]
[15,null,null,{"$f":"IF(COUNT(Questionnaire!$A$7:$A$40)<$A20,\" \",VLOOKUP($A20,Questionnaire!$A$7:$J$41,2,FALSE))","v":" "},{"$f":"IF(COUNT(Questionnaire!$A$7:$A$40)<$A20,\" \",IF(ISNA(VLOOKUP($A20,Questionnaire!$A$7:$O$41,12,FALSE)),\"\",VLOOKUP($A20,Questionnaire!$A$7:$O$41,12,FALSE)))","v":" "},{"$f":"IF(COUNT(Questionnaire!$A$7:$A$40)<$A20,\" \",IF(ISNA(VLOOKUP($A20, Questionnaire!$A$7:$M$41,13,FALSE)),\"\",VLOOKUP($A20, Questionnaire!$A$7:$M$41,13,FALSE)))","v":" "}]
[16,null,null,{"$f":"IF(COUNT(Questionnaire!$A$7:$A$40)<$A21,\" \",VLOOKUP($A21,Questionnaire!$A$7:$J$41,2,FALSE))","v":" "},{"$f":"IF(COUNT(Questionnaire!$A$7:$A$40)<$A21,\" \",IF(ISNA(VLOOKUP($A21,Questionnaire!$A$7:$O$41,12,FALSE)),\"\",VLOOKUP($A21,Questionnaire!$A$7:$O$41,12,FALSE)))","v":" "},{"$f":"IF(COUNT(Questionnaire!$A$7:$A$40)<$A21,\" \",IF(ISNA(VLOOKUP($A21, Questionnaire!$A$7:$M$41,13,FALSE)),\"\",VLOOKUP($A21, Questionnaire!$A$7:$M$41,13,FALSE)))","v":" "}]
[17,null,null,{"$f":"IF(COUNT(Questionnaire!$A$7:$A$40)<$A22,\" \",VLOOKUP($A22,Questionnaire!$A$7:$J$41,2,FALSE))","v":" "},{"$f":"IF(COUNT(Questionnaire!$A$7:$A$40)<$A22,\" \",IF(ISNA(VLOOKUP($A22,Questionnaire!$A$7:$O$41,12,FALSE)),\"\",VLOOKUP($A22,Questionnaire!$A$7:$O$41,12,FALSE)))","v":" "},{"$f":"IF(COUNT(Questionnaire!$A$7:$A$40)<$A22,\" \",IF(ISNA(VLOOKUP($A22, Questionnaire!$A$7:$M$41,13,FALSE)),\"\",VLOOKUP($A22, Questionnaire!$A$7:$M$41,13,FALSE)))","v":" "}]
[18,null,null,{"$f":"IF(COUNT(Questionnaire!$A$7:$A$40)<$A23,\" \",VLOOKUP($A23,Questionnaire!$A$7:$J$41,2,FALSE))","v":" "},{"$f":"IF(COUNT(Questionnaire!$A$7:$A$40)<$A23,\" \",IF(ISNA(VLOOKUP($A23,Questionnaire!$A$7:$O$41,12,FALSE)),\"\",VLOOKUP($A23,Questionnaire!$A$7:$O$41,12,FALSE)))","v":" "},{"$f":"IF(COUNT(Questionnaire!$A$7:$A$40)<$A23,\" \",IF(ISNA(VLOOKUP($A23, Questionnaire!$A$7:$M$41,13,FALSE)),\"\",VLOOKUP($A23, Questionnaire!$A$7:$M$41,13,FALSE)))","v":" "}]
[19,null,null,{"$f":"IF(COUNT(Questionnaire!$A$7:$A$40)<$A24,\" \",VLOOKUP($A24,Questionnaire!$A$7:$J$41,2,FALSE))","v":" "},{"$f":"IF(COUNT(Questionnaire!$A$7:$A$40)<$A24,\" \",IF(ISNA(VLOOKUP($A24,Questionnaire!$A$7:$O$41,12,FALSE)),\"\",VLOOKUP($A24,Questionnaire!$A$7:$O$41,12,FALSE)))","v":" "},{"$f":"IF(COUNT(Questionnaire!$A$7:$A$40)<$A24,\" \",IF(ISNA(VLOOKUP($A24, Questionnaire!$A$7:$M$41,13,FALSE)),\"\",VLOOKUP($A24, Questionnaire!$A$7:$M$41,13,FALSE)))","v":" "}]
[20,null,null,{"$f":"IF(COUNT(Questionnaire!$A$7:$A$40)<$A25,\" \",VLOOKUP($A25,Questionnaire!$A$7:$J$41,2,FALSE))","v":" "},{"$f":"IF(COUNT(Questionnaire!$A$7:$A$40)<$A25,\" \",IF(ISNA(VLOOKUP($A25,Questionnaire!$A$7:$O$41,12,FALSE)),\"\",VLOOKUP($A25,Questionnaire!$A$7:$O$41,12,FALSE)))","v":" "},{"$f":"IF(COUNT(Questionnaire!$A$7:$A$40)<$A25,\" \",IF(ISNA(VLOOKUP($A25, Questionnaire!$A$7:$M$41,13,FALSE)),\"\",VLOOKUP($A25, Questionnaire!$A$7:$M$41,13,FALSE)))","v":" "}]
[21,null,null,{"$f":"IF(COUNT(Questionnaire!$A$7:$A$40)<$A26,\" \",VLOOKUP($A26,Questionnaire!$A$7:$J$41,2,FALSE))","v":" "},{"$f":"IF(COUNT(Questionnaire!$A$7:$A$40)<$A26,\" \",IF(ISNA(VLOOKUP($A26,Questionnaire!$A$7:$O$41,12,FALSE)),\"\",VLOOKUP($A26,Questionnaire!$A$7:$O$41,12,FALSE)))","v":" "},{"$f":"IF(COUNT(Questionnaire!$A$7:$A$40)<$A26,\" \",IF(ISNA(VLOOKUP($A26, Questionnaire!$A$7:$M$41,13,FALSE)),\"\",VLOOKUP($A26, Questionnaire!$A$7:$M$41,13,FALSE)))","v":" "}]
[22,null,null,{"$f":"IF(COUNT(Questionnaire!$A$7:$A$40)<$A27,\" \",VLOOKUP($A27,Questionnaire!$A$7:$J$41,2,FALSE))","v":" "},{"$f":"IF(COUNT(Questionnaire!$A$7:$A$40)<$A27,\" \",IF(ISNA(VLOOKUP($A27,Questionnaire!$A$7:$O$41,12,FALSE)),\"\",VLOOKUP($A27,Questionnaire!$A$7:$O$41,12,FALSE)))","v":" "},{"$f":"IF(COUNT(Questionnaire!$A$7:$A$40)<$A27,\" \",IF(ISNA(VLOOKUP($A27, Questionnaire!$A$7:$M$41,13,FALSE)),\"\",VLOOKUP($A27, Questionnaire!$A$7:$M$41,13,FALSE)))","v":" "}]
[23,null,null,{"$f":"IF(COUNT(Questionnaire!$A$7:$A$40)<$A28,\" \",VLOOKUP($A28,Questionnaire!$A$7:$J$41,2,FALSE))","v":" "},{"$f":"IF(COUNT(Questionnaire!$A$7:$A$40)<$A28,\" \",IF(ISNA(VLOOKUP($A28,Questionnaire!$A$7:$O$41,12,FALSE)),\"\",VLOOKUP($A28,Questionnaire!$A$7:$O$41,12,FALSE)))","v":" "},{"$f":"IF(COUNT(Questionnaire!$A$7:$A$40)<$A28,\" \",IF(ISNA(VLOOKUP($A28, Questionnaire!$A$7:$M$41,13,FALSE)),\"\",VLOOKUP($A28, Questionnaire!$A$7:$M$41,13,FALSE)))","v":" "}]
[24,null,null,{"$f":"IF(COUNT(Questionnaire!$A$7:$A$40)<$A29,\" \",VLOOKUP($A29,Questionnaire!$A$7:$J$41,2,FALSE))","v":" "},{"$f":"IF(COUNT(Questionnaire!$A$7:$A$40)<$A29,\" \",IF(ISNA(VLOOKUP($A29,Questionnaire!$A$7:$O$41,12,FALSE)),\"\",VLOOKUP($A29,Questionnaire!$A$7:$O$41,12,FALSE)))","v":" "},{"$f":"IF(COUNT(Questionnaire!$A$7:$A$40)<$A29,\" \",IF(ISNA(VLOOKUP($A29, Questionnaire!$A$7:$M$41,13,FALSE)),\"\",VLOOKUP($A29, Questionnaire!$A$7:$M$41,13,FALSE)))","v":" "}]
[25,null,null,{"$f":"IF(COUNT(Questionnaire!$A$7:$A$40)<$A30,\" \",VLOOKUP($A30,Questionnaire!$A$7:$J$41,2,FALSE))","v":" "},{"$f":"IF(COUNT(Questionnaire!$A$7:$A$40)<$A30,\" \",IF(ISNA(VLOOKUP($A30,Questionnaire!$A$7:$O$41,12,FALSE)),\"\",VLOOKUP($A30,Questionnaire!$A$7:$O$41,12,FALSE)))","v":" "},{"$f":"IF(COUNT(Questionnaire!$A$7:$A$40)<$A30,\" \",IF(ISNA(VLOOKUP($A30, Questionnaire!$A$7:$M$41,13,FALSE)),\"\",VLOOKUP($A30, Questionnaire!$A$7:$M$41,13,FALSE)))","v":" "}]
{"$rows_left_out":14}
{"sheet":"Information","index":3,"n_rows":2,"n_cols":5,"rows_kept":2,"cut":false,"hidden":false,"merged":[]}
["Version #","Date","Author","Modification","Purpose"]
[1,"2020-02-01","Jerome Techer","New Release"]